SWE Sampler
change note: 2021-04-20 13:04:13.0 [tstevens] insert Definition (id: null text: A SWE sampler is used to collect snow samples for snow depth and snow water equivalent measurements. language code: en);
change note: 2021-04-20 13:03:16.0 [tstevens] Insert Concept add broader relation (SWE Sampler [abefe108-1df7-40ee-bab4-51218ba6bbf9,578404] - Samplers [78c70202-ab05-40d6-90db-563be2a8dc90,567170]);
in scheme: instruments
definition: A SWE sampler is used to collect snow samples for snow depth and snow water equivalent measurements.
type: Concept

Samplers
type: Concept