GAZETTEER
in scheme: sciencekeywords
definition: A geographical dictionary; a book giving the names and descriptions, etc., of many places.
type: Concept

REFERENCE AND INFORMATION SERVICES
type: Concept