AIRCRAFT MOTION SENSOR
change note: 2016-09-09 15:00:03.0 [saritz] insert AltLabel (id: null text: AIRCRAFT MOTION SENSOR language code: en); insert Definition (id: null text: An aircraft motion sensor is comprised of the GPS and INS plus associated hardware. Used to determine the motion of the aircraft with respect to the surface of the earth. language code: en);
change note: 2016-09-09 14:58:49.0 [saritz] Insert Concept add broader relation (AIRCRAFT MOTION SENSOR [ac739385-29c5-4cc8-a170-c28dcb00f8a5,277835] - Positioning/Navigation [596a5700-b3fd-4261-b8f8-a054d052e3fe,258857]);
in scheme: instruments
definition: An aircraft motion sensor is comprised of the GPS and INS plus associated hardware. Used to determine the motion of the aircraft with respect to the surface of the earth.
type: Concept

Positioning/Navigation
type: Concept