Columbia
change note: 2017-10-10 15:15:59.0 [sritz] insert AltLabel (id: null category: null text: COLUMBIA language code: en);
change note: 2017-10-10 14:30:54.0 [sritz] update PrefLabel (Columbia);
alternative label: COLUMBIA
in scheme: projects
definition: Columbia (OV-102), the first of NASA's orbiter fleet, was delivered to Kennedy Space Center in March 1979. Columbia initiated the Space Shuttle flight program when it lifted off Pad A in the Launch Complex 39 area at KSC on April 12, 1981. It proved the operational concept of a winged, reusable spaceship by successfully completing the Orbital Flight Test Program - missions STS-1 through STS-4. Other, achievements for Columbia included the recovery of the Long Duration Exposure Facility (LDEF) satellite from orbit during mission STS-32 in January 1990, and the STS-40 Spacelab Life Sciences mission in June 1991 - the first manned Spacelab mission totally dedicated to human medical research. Columbia was destroyed over east Texas on its landing descent to Kennedy Space Center on Feb. 1, 2003, at 8:59 a.m. EST at the conclusion of a microgravity research mission, STS-107. Columbia was named after a small sailing vessel that operated out of Boston in 1792 and explored the mouth of the Columbia River. One of the first ships of the U.S. Navy to circumnavigate the globe was named Columbia. The command module for the Apollo 11 lunar mission was also named Columbia. Text Source: http://www.nasa.gov/centers/kennedy/shuttleoperations/orbiters/orbiterscol.html
type: Concept

A - C
type: Concept