PERCOLATION
type: Concept

PERCOLATION RATE
change note: 2016-03-31 10:47:41.0 [gee-cee] insert Definition (id: null text: The speed of filtering fluids through porous materials within a certain time. language code: en);
change note: 2016-03-31 10:47:04.0 [gee-cee] Insert Concept add broader relation (PERCOLATION RATE [acdb39a8-1816-4d8d-bb80-38a94024035e,158807] - PERCOLATION [d64094ae-774b-4435-8f2e-a54d114e5555,85539]);
in scheme: sciencekeywords
definition: The speed of filtering fluids through porous materials within a certain time.
type: Concept