FOREST PROTECTION
in scheme: sciencekeywords
definition: Any measure related to or about the protection and/or conservation of forests from insects, diseases, pathogens, windstorms, excess logging, and decreased biotic diversity.
type: Concept

FOREST SCIENCE
type: Concept