ACADEMIC
type: Concept

USC/SCES/CME
in scheme: providers
definition: The Southern California Earthquake Center (SCEC) is a community of over 600 scientists, students, and others at over 60 institutions worldwide, headquartered at the University of Southern California. SCEC is funded by the National Science Foundation and the U.S. Geological Survey to develop a comprehensive understanding of earthquakes in Southern California and elsewhere, and to communicate useful knowledge for reducing earthquake risk. Summary provided by: http://www.scec.org/
type: Concept