ICE FLOES
in scheme: sciencekeywords
definition: Floe refers to any relatively flat piece of ice 20 m or more across. Floes are subdivided according to horizontal extent: small, medium, big, vast, giant.
type: Concept

SEA ICE
type: Concept