Resurs-P N2
change note: 2021-12-01 12:30:36.0 [tstevens] Move Concepts delete broader relation (null); add broader relation (Resurs-P N2 [b00d17a2-b509-4b42-86fd-d50bf50cfc3c,826640] - Resurs [ef6c9735-8d68-4432-9e5e-a2c1ccd2fa90,835929]);
change note: 2021-11-18 12:59:43.0 [tstevens] Move Concepts delete broader relation (null); add broader relation (Resurs-P N2 [b00d17a2-b509-4b42-86fd-d50bf50cfc3c,826640] - Earth Observation Satellites [3466eed1-2fbb-49bf-ab0b-dc08731d502b,826121]);
change note: 2015-08-03 08:40:13.0 [mpmorahan] insert AltLabel (id: null text: Environmental Satellite Resurs-P N2 language code: en);
change note: 2021-11-18 12:44:02.0 [tstevens] Move Concepts delete broader relation (null); add broader relation (Resurs-P N2 [b00d17a2-b509-4b42-86fd-d50bf50cfc3c,826640] - Space-based Platforms [b39a69b4-c3b9-4a94-b296-bbbbe5e4c847,835875]);
change note: 2015-08-03 08:38:06.0 [mpmorahan] Insert Concept add broader relation (Resurs-P N2 [b00d17a2-b509-4b42-86fd-d50bf50cfc3c,158119] - Earth Observation Satellites [3466eed1-2fbb-49bf-ab0b-dc08731d502b,143415]);
definition: Environmental Satellite Resurs-P N2 Group: Platform_Details Entry_ID: Resurs-P N2 Group: Platform_Identification Platform_Category: Earth Observation Satellites Short_Name: Resurs-P N2 Long_Name: Environmental Satellite Resurs-P N2 End_Group Group: Platform_Associated_Instruments Short_Name: Geoton-L1 (2) Short_Name: GSA (1) Short_Name: SHMSA-VR Short_Name: SHMSA-SR End_Group Group: Orbit Orbit_Altitude: 475 km Orbit_Inclination: 97 degrees Repeat_Cycle: 3 days Orbit_Type: LEO > LOW EARTH ORBIT > POLAR SUN-SYNCHRONOUS End_Group Creation_Date: 2015-01-26 Online_Resource: http://samspace.ru/products/earth_remote_sensing_satellites/ka_resurs_p/ Online_Resource: http://en.samspace.ru/products/earth_remote_sensing_satellites/ka_resurs_p/ Sample_Image: https://hi-tech.imgsmail.ru/hitech_img/source/a9/e4/60d9293c45c431051af8cf310903.jpg Group: Platform_Logistics Launch_Date: 2015-12-26 Design_Life: 5 years End_Group End_Group
in scheme: platforms
type: Concept

Resurs
type: Concept