MHS
change note: 2019-02-22 13:26:18.0 [mmorahan] insert WeightedRelation (id: null related concept uuid: 6120cea0-c943-4c7c-bddd-8d8648d58022 relationship type: null relationship value: null generated by: null);
in scheme: instruments
definition: [Text and Instrument Image Source: NASA POES Project home page, http://goespoes.gsfc.nasa.gov/poes/instruments/mhs.html ] The MHS is a new instrument for the NOAA series of satellites. It is a five-channel microwave instrument intended primarily to measure profiles of atmospheric humidity. It is also sensitive to liquid water in clouds and measures cloud liquid water content. Additionally, it provides qualitative estimates of the precipitation rate. Because of the high variability of atmospheric water, the MHS has a higher resolution than the AMSU-A, with an approximate 16-km (1 mi) diameter circular field of view at nadir. Ninety such fields of view are measure in each cross-track scan. The instrument has approximately the same swath width as AMSU-A but scans across-track in one-third the time in order to keep the two instruments synchronized. By this means, arrays of 3 x 3 MHS samples will overlay each AMSU-A sample, facilitating synergistic use of these instruments. MHS has four humidity channels in the 157 GHz to 190 GHz range. As with AMSU-A, it also has a surface-viewing window channel at 89 GHz, partly to ensure cross-registration of the two sounding instruments. Group: Instrument_Details Entry_ID: MHS Group: Instrument_Identification Instrument_Category: Earth Remote Sensing Instruments Instrument_Class: Passive Remote Sensing Instrument_Type: Profilers/Sounders Short_Name: MHS Long_Name: Microwave Humidity Sounder End_Group Group: Associated_Platforms Short_Name: NOAA-19 Short_Name: NOAA-18 Short_Name: METOP-A Short_Name: METOP-B End_Group Group: Spectral_Frequency_Information Wavelength_Keyword: Microwave Number_Channels: 5 Spectral_Frequency_Coverage_Range: 89.0 GHz - 190.31 GHz End_Group Online_Resource: http://www.ncdc.noaa.gov/oa/pod-guide/ncdc/docs/klm/html/c3/sec3-9.htm Online_Resource: http://wdc.dlr.de/sensors/mhs/ Group: Instrument_Logistics Instrument_Owner: USA/NASA Instrument_Owner: USA/NOAA Instrument_Owner: EUMETSAT End_Group End_Group
type: Concept

Profilers/Sounders
type: Concept