Magnetic Field/Electric Field Instruments
type: Concept

PROTON MAGNETOMETER
change note: 2021-08-04 17:31:27.0 [sritz] insert AltLabel (id: null category: primary text: PROTON MAGNETOMETER language code: en);
in scheme: instruments
definition: A PROTON MAGNETOMETER is a measuring meter instrument that measures the Earth?s magnetic field intensity, but this uses protons (positively charged particles) to help measure properly.
type: Concept