SNOW MELT
change note: 2012-07-10 15:57:30.0 [mpmorahan] insert Definition (id: null text: Pertaining to the rate and extent of melting snow pack(s). language code: en);
change note: 2012-06-26 13:43:22.0 [gee-cee] Insert Concept add broader relation (SNOW MELT [b1be402f-336c-4f1f-8542-9807264a09a7,39945] - CRYOSPHERIC INDICATORS [76b8c21c-c221-4724-86ef-c07222cb152b,39899]);
in scheme: sciencekeywords
definition: Pertaining to the rate and extent of melting snow pack(s).
type: Concept

CRYOSPHERIC INDICATORS
type: Concept