NSF
type: Concept

LTER/BNZ
in scheme: providers
definition: The Bonanza Creek Long Term Ecological Research program is located in the boreal forests, or taiga, of interior Alaska, USA. Ecological research is conducted at two main facilities, Bonanza Creek Experimental Forest and Caribou-Poker Creeks Research Watershed. The LTER program is supported and hosted by the University of Alaska Fairbanks and the USDA Forest Service, Pacific Northwest Research Station in the city of Fairbanks, Alaska. Major funding is provided by the National Science Foundation. Website: "http://www.lter.uaf.edu/" [Summary provided by Bonanza Creek LTER.]
type: Concept