CALIBRATION/VALIDATION
type: Concept

VALIDATION
change note: 2020-05-21 11:23:48.0 [tstevens] Insert Concept add broader relation (VALIDATION [b283a59c-0e9a-469c-baf4-591b64cd4671,560193] - CALIBRATION/VALIDATION [4f938731-d686-4d89-b72b-ff60474bb1f0,86319]);
in scheme: sciencekeywords
definition: The process of ensuring data have undergone data cleansing to ensure they have data quality, that is, that they are both correct and useful. It uses routines, often called "validation rules", "validation constraints", or "check routines", that check for correctness, meaningfulness, and security of data that are input to the system. The rules may be implemented through the automated facilities of a data dictionary, or by the inclusion of explicit application program validation logic of the computer and its application.
type: Concept