RADIO WAVE FLUX
in scheme: sciencekeywords
definition: An electrical impusle sent through the atmosphere at radio frequency (usually between 10 kHz and 300,000 MHz).
type: Concept

RADIO WAVE
type: Concept