SR/SRCC
in scheme: providers
definition: The Southern Regional Climate Center is a partner of the national climate service program that includes the National Climatic Data Center, Regional Climate Centers, and State Climate offices. The center provides climate data and products, climate monitoring and assessment services, educational resources and weather and climate information and links. Users can also access numerous climatic data and products. Website: "http://www.srcc.lsu.edu/"
type: Concept

SOUTHERN REGION
type: Concept