AFFORESTATION/REFORESTATION
in scheme: sciencekeywords
definition: Afforestation: "the establishment of trees on an area that has lacked forest cover for a very long time or has never been forested. " Reforestation: " the natural or artificial restocking (i.e., planting, seeding) of an area with forest trees. Also called forest regeneration. "
type: Concept

FOREST SCIENCE
type: Concept