ENERGY PRODUCTION/USE
type: Concept

WIND ENERGY PRODUCTION/USE
change note: 2012-06-29 13:58:05.0 [tbs1979] insert Definition (id: null text: Refers to the production and use of wind energy for human consumption. Wind energy/power is the conversion of wind energy into a useful form of energy, such as using wind turbines to make electricity and wind mills for mechanical power. language code: en);
change note: 2012-06-26 15:45:40.0 [tbs1979] Insert Concept add broader relation (WIND ENERGY PRODUCTION/USE [b3a95e10-1c1d-41cf-8802-8bb1d3a41353,40119] - ENERGY PRODUCTION/USE [b73cee46-8e2c-4df9-b1ed-7f0aa98a04ac,40101]);
in scheme: sciencekeywords
definition: Refers to the production and use of wind energy for human consumption. Wind energy/power is the conversion of wind energy into a useful form of energy, such as using wind turbines to make electricity and wind mills for mechanical power.
type: Concept