Subsurface
type: Concept

Little Hercules
definition: Little Hercules is a 4000m depth rated Remotely Operated Vehicle (ROV), with an impressive past and most promising future. “Little Herc”, as he is widely referred to is just that; “little”. But as we all know, many good things come in small packages. Little Herc came to the Okeanos Explorer through collaboration between NOAA’s Office of Ocean Exploration and Research and Dr. Robert Ballard’s Institute for Exploration (IFE) at the University of Rhode Island (URI). With a major commitment to explore the waters off Indonesia, our Program’s much larger ROV could not be readied in time for our 2010 sailing date. As a result, Little Herc was chosen as our stand-in. Originally developed by a team of engineers at IFE, Little Herc first came into the spotlight when he gave the world the first and only images of John Kennedy’s PT Boat; PT-109. After several other successful missions for IFE, Little Herc stepped down, taking a back seat to the now much larger and spectacular, “Hercules”. After doing a short stint as an exhibit piece in the Mystic Aquarium, a proposal by the NOAA Office of Ocean Exploration has given new life to the veteran “Explorer”. Through a Joint Project Agreement (JPA) between NOAA, IFE and URI, a team of engineers from several institutions and companies once again went to work, this time recommissioning Little Herc. In a field where technology advances rapidly, it was necessary and appropriate that Little Herc receive a substantial upgrade before joining the ship. After an extensive 4 month overhaul, Little Herc boasted a new motor controller and power bottle system, an upgraded fiber optic multiplexer system, a new Ultra Short Baseline Tracking System (USBL), a full color imaging sonar, a new Conductivity-Temperature-Depth (CTD) sensor, two new single chip color CCD cameras, two new LED lights, two 400watt HMI Lights and a spectacular High Definition video camera. New tethers, new tether terminations, a new transformer, a new electrical junction box, ne…
type: Concept
in scheme: platforms
change note: 2021-11-18 11:10:16.0 [tstevens] Move Concepts delete broader relation (null); add broader relation (Little Hercules [b3ef5a11-5c6d-4f14-a0bb-a90e8614a908,826659] - Subsurface [35f1c0af-8379-4812-a130-08d84514fc98,835899]);
change note: 2020-01-21 13:12:55.0 [tstevens] insert Definition (id: null text: Little Hercules is a 4000m depth rated Remotely Operated Vehicle (ROV), with an impressive past and most promising future. “Little Herc”, as he is widely referred to is just that; “little”. But as we all know, many good things come in small packages. Little Herc came to the Okeanos Explorer through collaboration between NOAA’s Office of Ocean Exploration and Research and Dr. Robert Ballard’s Institute for Exploration (IFE) at the University of Rhode Island (URI). With a major commitment to explore the waters off Indonesia, our Program’s much larger ROV could not be readied in time for our 2010 sailing date. As a result, Little Herc was chosen as our stand-in. Originally developed by a team of engineers at IFE, Little Herc first came into the spotlight when he gave the world the first and only images of John Kennedy’s PT Boat; PT-109. After several other successful missions for IFE, Little Herc stepped down, taking a back seat to the now much larger and spectacular, “Hercules”. After doing a short stint as an exhibit piece in the Mystic Aquarium, a proposal by the NOAA Office of Ocean Exploration has given new life to the veteran “Explorer”. Through a Joint Project Agreement (JPA) between NOAA, IFE and URI, a team of engineers from several institutions and companies once again went to work, this time recommissioning Little Herc. In a field where technology advances rapidly, it was necessary and appropriate that Little Herc receive a substantial upgrade before joining the ship. After an extensive 4 month overhaul, Little Herc boasted a new motor controller and power bottle system, an upgraded fiber optic multiplexer system, a new Ultra Short Baseline Tracking System (USBL), a full color imaging sonar, a new Conductivity-Temperature-Depth (CTD) sensor, two new single chip color CCD cameras, two new LED lights, two 400watt HMI Lights and a spectacular High Definition video camera. New tethers, new tether…
change note: 2021-12-02 08:37:04.0 [tstevens] Move Concepts delete broader relation (null); add broader relation (Little Hercules [b3ef5a11-5c6d-4f14-a0bb-a90e8614a908,826659] - Subsurface [31eb34c8-016e-48c4-9404-7d94ee66cfde,835901]);
change note: 2020-01-21 12:26:43.0 [tstevens] Insert Concept add broader relation (Little Hercules [b3ef5a11-5c6d-4f14-a0bb-a90e8614a908,559743] - ROV [da6420b6-48ec-4ae2-98c7-0ef0538815a0,542741]);