SEDIMENTATION
change note: 2017-03-10 08:51:50.0 [tstevens] update Definition (The process of deposition of sediment, especially by mechanical means from a state of suspension in water or air.); update Definition (Dictionary of Geological Terms, American Geological Institute, 1984.);
in scheme: sciencekeywords
definition: The process of deposition of sediment, especially by mechanical means from a state of suspension in water or air.
type: Concept

EROSION/SEDIMENTATION
type: Concept