GRUMP
in scheme: projects
definition: The Global Rural-Urban Mapping Project incorporates urban and rural information of human population, allowing new insights into urban population distribution and the global extents of human settlements. Project URL: http://sedac.ciesin.columbia.edu/gpw/ [Summary provided by SEDAC.]
type: Concept

G - I
type: Concept