COMMERCIAL
type: Concept

CAMPBELL-SCI
in scheme: providers
definition: Campbell Scientific manufactures dataloggers, data acquisition systems, and measurement and control products used worldwide in research and industry. Our instrumentation is known for its flexibility, precision measurements, and dependability?even in harsh, remote environments. Website: "http://www.campbellsci.com/" [Summary provided by Campbell Scientific, Inc.]
type: Concept