INFRARED THERMOMETERS
change note: 2021-08-05 12:23:46.0 [sritz] insert AltLabel (id: null category: primary text: INFRARED THERMOMETERS language code: en);
in scheme: instruments
definition: Infrared Thermometers - Infrared sensors developed to remotely measure the temperature of distant stars and planets, led to the development of the hand-held optical sensor thermometer. Placed inside the ear canal, the thermometer provides an accurate reading in two seconds or less. [Source: NASA]
type: Concept

Thermometers
type: Concept