LAND SURFACE/AGRICULTURE INDICATORS
type: Concept

EROSION
change note: 2012-07-16 12:20:32.0 [mpmorahan] insert Definition (id: null text: The process by which soil, rock or sand is gradually worn away by water or wind action. language code: en);
change note: 2012-06-26 12:00:35.0 [gee-cee] Insert Concept add broader relation (EROSION [b51f738c-7061-4ced-b216-53734ce4cb43,39845] - LAND SURFACE/AGRICULTURE INDICATORS [112e71ec-c0a1-49a8-82d7-bcb317b45860,39835]);
in scheme: sciencekeywords
definition: The process by which soil, rock or sand is gradually worn away by water or wind action.
type: Concept