NISTAR
change note: 2017-06-07 10:29:30.0 [sritz] insert AltLabel (id: null text: National Institute of Standards and Technology Advanced Radiometer language code: en); insert Definition (id: null text: NISTAR is an active cavity radiometer designed to measure the energy reflected and emitted from the entire sunlit face of the Earth from its orbit around the Lagrangian point 1 (L1). L1 is a neutral gravity point between Earth and the sun. This position offers a unique continuous view of the Earth at from sunrise to sunset. language code: en);
change note: 2017-06-07 10:28:16.0 [sritz] Insert Concept add broader relation (NISTAR [b59f2392-310f-4542-bf7e-17c84f0c3242,309641] - Radiometers [5b753e40-b3f1-426a-8d92-ffee1d675468,289971]);
in scheme: instruments
definition: NISTAR is an active cavity radiometer designed to measure the energy reflected and emitted from the entire sunlit face of the Earth from its orbit around the Lagrangian point 1 (L1). L1 is a neutral gravity point between Earth and the sun. This position offers a unique continuous view of the Earth at from sunrise to sunset.
type: Concept

Radiometers
type: Concept