CLEAVAGE
change note: 2013-03-22 08:40:46.0 [tbs1979] insert Definition (id: null text: Breakage of a mineral along a flat plane of weakness. language code: en);
change note: 2013-03-05 13:00:12.0 [tbs1979] Insert Concept add broader relation (CLEAVAGE [b5ae8710-8c7e-48ab-bf0f-2f18b2598a5a,83025] - SEDIMENTARY ROCK PHYSICAL/OPTICAL PROPERTIES [609aeae6-388f-41a1-8813-a2e760e8fdb7,83003]);
in scheme: sciencekeywords
definition: Breakage of a mineral along a flat plane of weakness.
type: Concept

SEDIMENTARY ROCK PHYSICAL/OPTICAL PROPERTIES
type: Concept