INTEXB
in scheme: projects
change note: 2014-05-09 20:08:33.0 [128.183.164.42] insert AltLabel (id: null text: Intercontinental Chemical Transport Experiment - Phase B (INTEX-B) language code: en);
change note: 2016-03-16 13:52:40.0 [saritz] S. Ritz revised project at request of ASDC DAAC. insert AltLabel (id: null text: INTEX-B language code: en); update PrefLabel (INTEXB);
change note: 2014-05-09 19:56:58.0 [128.183.164.42] Insert Concept add broader relation (INTEX-B [b608ea3c-dc24-4f25-83dc-4f94b8f5a0e8,106371] - G - I [af0968ce-ffe3-44a0-86de-2ec9b9a8fa5d,77509]);
change note: 2014-05-09 19:59:56.0 [128.183.164.42] insert Definition (id: null text: Intercontinental Chemical Transport Experiment - Phase B (INTEX-B) was an integrated atmospheric field experiment performed over North America. It focused on Mexico City pollution outflow and Asian pollution outflow to understand the transport and transformation of gases and aerosols on transcontinental/intercontinental scales and their impact on air quality and climate. A particular focus in this study was to quantify and characterize the inflow and outflow of pollution over North America. The main constituents of interest were ozone and precursors, aerosols and precursors, and the long-lived greenhouse gases. language code: en);
alternative label: INTEX-B
type: Concept
definition: Intercontinental Chemical Transport Experiment - Phase B (INTEX-B) was an integrated atmospheric field experiment performed over North America. It focused on Mexico City pollution outflow and Asian pollution outflow to understand the transport and transformation of gases and aerosols on transcontinental/intercontinental scales and their impact on air quality and climate. A particular focus in this study was to quantify and characterize the inflow and outflow of pollution over North America. The main constituents of interest were ozone and precursors, aerosols and precursors, and the long-lived greenhouse gases.

G - I
type: Concept