HYDROTHERMAL VENTS
in scheme: sciencekeywords
definition: Pertaining to the fractures in the oceanic crust where superheated water is ejected into the ocean, providing a source of minerals, and unusual life forms.
type: Concept

MARINE VOLCANISM
type: Concept