AVHRR 1-KM PATHFINDER
in scheme: projects
definition: The Advanced Very High Resolution Radiometer (AVHRR) Polar Pathfinder Twice-Daily 5 km EASE-Grid Composites are a collection of products for both poles, consisting of twice-daily calibrated and gridded satellite channel data and derived parameters. Data include five AVHRR channels, clear sky surface broadband albedo and skin temperature, solar zenith angle, satellite elevation angle, sun-satellite relative azimuth angle, surface type mask, cloud mask, and Universal Coordinated Time (UTC) of acquisition. AVHRR Polar Pathfinder data extend pole ward from 48.4 degrees north and 53.2 degrees south latitudes, from 24 July 1981 through 30 June 2005. Data are in 1-byte and 2-byte integer grid format and are available by FTP. Summary provided by http://nsidc.org/data/docs/daac/nsidc0066_avhrr_5km.gd.html
type: Concept

A - C
type: Concept