SEAFLOOR TOPOGRAPHY
in scheme: sciencekeywords
definition: General elevation pattern of the land surface or the ocean bottom. Also refer to as bathymetry, the study and mapping of sea floor elevations and the variations of water depth; the topography of the sea floor.
type: Concept

BATHYMETRY/SEAFLOOR TOPOGRAPHY
type: Concept