NEW HAMPSHIRE
type: Concept

NH/CLIM
in scheme: providers
definition: The New Hampshire State Climate Office (NHSCO) resides with the Department of Geography at the University of New Hampshire. The mission of the NHSCO is to serve the citizens of New Hampshire and northern New England by providing access to climatological data sets, conducting climate research relevant to user needs throughout the region, and serving as a focal point for climate education and outreach. Website: http://www.unh.edu/stateclimatologist/ [Summary provided by the University of New Hampshire.]
type: Concept