NORTHEAST BRAZIL RAINFALL ANOMALY
change note: 2012-07-03 10:58:53.0 [mpmorahan] insert Definition (id: null text: The northeast Brazil rainfall index is calculated from data for Fortaleza (3.7S, 38.5W) and Quixeramobim (5.3S, 39.3W) Brazil obtained from the NCAR World Monthly Surface Station Climatology. Climatological mean is for 1950-79. language code: en);
change note: 2012-06-25 10:00:51.0 [mpmorahan] Insert Concept add broader relation (NORTHEAST BRAZIL RAINFALL ANOMALY [b8f0571c-4c19-4025-936c-936e9ac72e21,39673] - PRECIPITATION INDICES [52347642-9786-4b59-be77-02e9f307118d,39663]);
in scheme: sciencekeywords
definition: The northeast Brazil rainfall index is calculated from data for Fortaleza (3.7S, 38.5W) and Quixeramobim (5.3S, 39.3W) Brazil obtained from the NCAR World Monthly Surface Station Climatology. Climatological mean is for 1950-79.
type: Concept

PRECIPITATION INDICES
type: Concept