ACADEMIC
type: Concept

ALBION/GEOL
in scheme: providers
definition: The Albion College Department of Geology provides a curriculum for students with a strong undergraduate preparation for more specialized training at the graduate level or for on-the-job training by industries and government agencies. The department also has an GIS and Digital Map Laboratory. Website: "http://www.albion.edu/geology/" [Summary provided by Albion College.]
type: Concept