MSU/ENTO
in scheme: providers
definition: The Department of Entomology works through two colleges- the College of Agriculture and Natural Resources and the College of Natural Science. This two-college arrangement enables students to integrate the agriculture/natural resources and biological/physical sciences in an optimally beneficial way. We offer B.S., M.S., and Ph.D. degrees. Specialized research focus includes Biomedical Entomology, Forest Entomology, Fruit Entomology-Nematology, Insect-Nematode Ecology, Behavior and Spatial Dynamics, Insect Toxicology, Integrated Pest Management Research/Extension Programs, Molecular Entomology, Pesticide Education and Policy, and Public Science Education. Website: "http://www.ent.msu.edu/" [Summary provided by Michigan State University.]
type: Concept

ACADEMIC
type: Concept