CHNS/O ELEMENTAL ANALYZERS
in scheme: instruments
definition: Instrument used for measuring carbon, hydrogen, nitrogen, sulfur or oxygen content in organic and other types of materials. Group: Instrument_Details Entry_ID: CHNS/O ELEMENTAL ANALYZERS Group: Instrument_Identification Instrument_Category: In Situ/Laboratory Instruments Instrument_Class: Chemical Meters/Analyzers Short_Name: CHNS/O ELEMENTAL ANALYZERS End_Group Online_Resource: http://las.perkinelmer.com/content/RelatedMaterials/Brochures/BRO_2400SeriesIICHNSOelementalAnalyzer.pdf Creation_Date: 2009-10-15 End_Group
type: Concept

Chemical Meters/Analyzers
type: Concept