HABSOS
change note: 2019-08-14 07:39:22.0 [tstevens] insert AltLabel (id: null category: primary text: Harmful Algal BloomS Observing System language code: en); insert Definition (id: null text: HABSOS is a data collection and distribution system for harmful algal bloom (HAB) information in the Gulf of Mexico. language code: en);
change note: 2019-08-14 07:38:13.0 [tstevens] Insert Concept add broader relation (HABSOS [ba22081f-0fd2-46b4-ad47-db1361ae2c92,369033] - G - I [af0968ce-ffe3-44a0-86de-2ec9b9a8fa5d,351587]);
in scheme: projects
definition: HABSOS is a data collection and distribution system for harmful algal bloom (HAB) information in the Gulf of Mexico.
type: Concept

G - I
type: Concept