FLUVIAL LANDFORMS
type: Concept

FLOOD PLAIN
change note: 2013-08-15 12:48:35.0 [tbs1979] update Definition (PhysicalGeography.net);
change note: 2013-08-15 12:44:56.0 [tbs1979] insert Definition (id: null text: Flat or nearly flat land adjacent to a stream or river that experiences occasional or periodic flooding. language code: en);
change note: 2013-08-05 12:34:00.0 [tbs1979] Insert Concept add broader relation (FLOOD PLAIN [ba37314d-ec38-4e67-bf30-7e1fdc6bfbad,105309] - FLUVIAL LANDFORMS [bdc0bd86-a3a3-48fa-b1fb-4ca5d13d4dde,105281]);
in scheme: sciencekeywords
definition: Flat or nearly flat land adjacent to a stream or river that experiences occasional or periodic flooding.
type: Concept