KARMAN VORTEX STREET
type: Concept

VORTEX STREET
definition: (Also called Kármán vortex street, vortex trail, vortex train.) Two parallel rows of alternately placed vortices along the wake of an obstacle in a fluid of moderate Reynolds number. Fluid drag can be calculated from the motion of these vortices, which are stable only for a certain ratio of the width of the street to the distance between vortices along the street.
change note: 2013-03-21 14:17:41.0 [mpmorahan] insert Definition (id: null text: (Also called Kármán vortex street, vortex trail, vortex train.) Two parallel rows of alternately placed vortices along the wake of an obstacle in a fluid of moderate Reynolds number. Fluid drag can be calculated from the motion of these vortices, which are stable only for a certain ratio of the width of the street to the distance between vortices along the street. language code: en);
change note: 2013-02-14 12:48:23.0 [mpmorahan] Insert Concept add narrower relation (VORTEX STREET [ba4a9964-8323-45df-a372-b4e2f3eef9e5,82295] - KARMAN VORTEX STREET [2d00d3c4-2ef3-49f6-9261-6184f6517b4f,82299]);
change note: 2013-02-14 12:46:29.0 [mpmorahan] Insert Concept add broader relation (VORTEX STREET [ba4a9964-8323-45df-a372-b4e2f3eef9e5,82295] - CLOUD DYNAMICS [62019831-aaba-4d63-a5cd-73138ccfa5d0,82131]);
in scheme: sciencekeywords
type: Concept

CLOUD DYNAMICS
type: Concept