MG/ONE
in scheme: providers
definition: Our missions correspond to expected results at the end of the programs. -Bring back environmental equilibrium in sensible regions, -Let realize related salvation works, -Set up structures for a durable protection and cohabitation of the population and its environment, -Lay out strategies for environment aware self-managing in sensible regions, In 1990, the malagasy government gave to the ONE the following attributions: -Elaboration of periodic environmental strategies, -Set up of management procedures, -Administrative, technical and financial management of periodic action programs, -Environmental action programs and related projects management, -Set up of investment and environmental compatibility Website: "http://www.refer.mg/cop/one/" [Summary provided by The National Office for the Environment in Madagascar.]
type: Concept

MADAGASCAR
type: Concept