TCM-90
in scheme: projects
definition: The Tropical Cyclone Motion (TCM-90) Research Initiative, sponsored by the Office of Naval Research (ONR), was a project dedicated to understanding tropical cyclone motion and improving forecast accuracy.
type: Concept

S - U
type: Concept