EPA
type: Concept

EPA/NERL/ERD
in scheme: providers
definition: The U.S. EPA Office of Research and Development is divided into five National Laboratories and Centers. "The Office of Research and Development provides the scientific foundation for the Agency's environmental protection mission....." ...more... The Ecosystems Research Division of the National Exposure Research Laboratory performs research on approaches to multimedia modeling for landscape, nutrient and chemical stressors of ecosystems. ...more... ERD is located in Athens, Georgia, in the foothills of the Northeast Georgia Mountains. Historic Athens is the home of the University of Georgia. The 60+ members of the scientific, engineering, administrative and clerical staff are actively involved in the life of the community, including our partnership with Fourth Street Elementary School. The Lifespan childcare center is located on the southwest corner of the ERD grounds. The Center is owned by the EPA and operated under contract by Athens Montessori School. Its primary purpose is to provide quality childcare to children of EPA and other U.S. Government employees or legal guardians in the Athens area. The Center is open to all families in the Athens area; however, children of federal employees are given priority for enrollment. Summary provided by http://www.epa.gov/athens/about/index.html
type: Concept