USDA
type: Concept

USDA/NRCS/NWCC
in scheme: providers
definition: The mission of the USDA National Water and Climate Center is to help people conserve, improve, and sustain our natural resources and environment. Functions of the center include natural resource planning support, data acquisition and management, technology innovation, gain partnerships, and provide knowledge and technology to the public. Website: "http://www.wcc.nrcs.usda.gov/" [Summary provided by the USDA.]
type: Concept