A - C
type: Concept

ARCSS/LAII/ATLAS
in scheme: projects
definition: ATLAS is a coordinated program that will examine the geographical patterns and controls over climate-land surface exchange and develop reasonable scenarios of future change in the Arctic. For more information, link to " http://www.laii.uaf.edu/projects.htm"
type: Concept