OBSERVATION BASED
change note: 2021-11-30 13:40:24.0 [tstevens] Move Concepts delete broader relation (null); add broader relation (OBSERVATION BASED [bb5002a8-6ff2-43dd-b0c9-8f9a76e11cb5,826689] - Models [0a184cdc-c074-4946-90a6-02f03c686341,835911]);
change note: 2022-03-11 14:22:01.0 [tstevens] insert Definition (id: null text: An Observation-Based Model (OBM) is described, which uses in-situ atmospheric observations to determine the sensitivity of ozone concentrations in an urban atmosphere to changes in the emissions of ozone precursors (i.e., volatile organic compounds and nitrogen oxides). language code: en);
change note: 2015-11-24 13:06:57.0 [epneff] Rename Concept update PrefLabel (OBSERVATION BASED ANALYSES);
change note: 2015-11-24 13:04:57.0 [epneff] Insert Concept add broader relation (Observation Based Analyses [bb5002a8-6ff2-43dd-b0c9-8f9a76e11cb5,158503] - Models/Analyses [113ecbc2-ab36-4d58-a96c-a6ce0106e749,143215]);
change note: 2015-11-30 17:45:06.0 [saritz] insert AltLabel (id: null text: OBSERVATION BASED ANALYSES language code: en); update PrefLabel (OBSERVATION BASED);
in scheme: platforms
definition: An Observation-Based Model (OBM) is described, which uses in-situ atmospheric observations to determine the sensitivity of ozone concentrations in an urban atmosphere to changes in the emissions of ozone precursors (i.e., volatile organic compounds and nitrogen oxides).
type: Concept

Models
type: Concept