CCD LINEAR ARRAY
change note: 2021-08-04 17:35:28.0 [sritz] insert AltLabel (id: null category: primary text: CCD LINEAR ARRAY language code: en);
in scheme: instruments
definition: The CCD linear array on board the Meteor-3M-1, along with the spectrometer, provides continuous wavelength coverage between 290 and 1040 nm with a spectral resolution between 1.2 to 2.5 nm, permitting the measurement of multiple absorption features of each gaseous species and multi-wavelength measurement of broadband extinction by aerosols. Nine channels are routinely utilized in solar occultation measurements and three channels are used in lunar measurements. Spectral calibration is continuous, combined with the self-calibrating nature of the occultation technique. In addition, the CCD array permits in-orbit wavelength and intensity calibration from observations of the exo-atmospheric solar Fraunhofer spectrum. Information obtained from http://www.eoportal.org/ Group: Instrument_Details Entry_ID: CCD LINEAR ARRAY Group: Instrument_Identification Instrument_Category: Earth Remote Sensing Instruments Instrument_Class: Passive Remote Sensing Instrument_Type: Photon/Optical Detectors Instrument_Subtype: Cameras Short_Name: CCD LINEAR ARRAY End_Group Group: Associated_Platforms Short_Name: METEOR-3M End_Group Online_Resource: http://directory.eoportal.org/get_announce.php?an_id=8273 Creation_Date: 2008-07-11 End_Group
type: Concept

Cameras
type: Concept