CHEMICAL SOLUTION
change note: 2017-03-10 07:42:50.0 [tstevens] insert Definition (id: null text: The removal of rock in solution by acidic rainwater. In particular, limestone is weathered by rainwater containing dissolved CO2. language code: en);
change note: 2013-02-18 14:31:40.0 [tbs1979] Insert Concept add broader relation (CHEMICAL SOLUTION [bb891ee1-6c7b-4ec0-b2fa-6fb67a2df2a3,82633] - COASTAL PROCESSES [672d6958-4bbc-4b33-adc8-927e4348908b,82553]);
in scheme: sciencekeywords
definition: The removal of rock in solution by acidic rainwater. In particular, limestone is weathered by rainwater containing dissolved CO2.
type: Concept

COASTAL PROCESSES
type: Concept