CRYOSPHERIC INDICATORS
type: Concept

AVALANCHE
change note: 2012-07-10 10:26:10.0 [mpmorahan] insert Definition (id: null text: Pertaining to the measuerment of a large mass of snow, ice, soil, rock, falling rapidly from heights far above a lowland area. language code: en);
change note: 2012-06-26 13:15:42.0 [gee-cee] Insert Concept add broader relation (AVALANCHE [bb8c48bc-a36e-4f7e-afda-3244b058bc9c,39901] - CRYOSPHERIC INDICATORS [76b8c21c-c221-4724-86ef-c07222cb152b,39899]);
in scheme: sciencekeywords
definition: Pertaining to the measuerment of a large mass of snow, ice, soil, rock, falling rapidly from heights far above a lowland area.
type: Concept