MULTINATIONAL ORGANIZATIONS
type: Concept

ESA/EARTHNET
in scheme: providers
definition: [Text Source: ESA Earthnet Online, http://earth.esa.int/object/index.cfm?fobjectid=5062 ] Earthnet Online is the entry point for scientific-technical information on Earth Observation activities by the European Space Agency (ESA). The web portal provides a vast amount of content, grown and collected over more than a decade: Detailed technical information on Earth Observation (EO) missions, satellites and sensors, EO data products and services, online resources such as catalogues and library, a section dedicated to applications of satellite data, and access to promotional satellite imagery. http://earth.esa.int
type: Concept