UCO/CIEI
in scheme: providers
definition: CCITA is dedicated to creating and fostering focused interactions between scientists, engineers, and mathematicians for the purpose of developing and applying advanced methodologies in physics, geophysics, and high performance computer modeling to research of direct relevance to national and international safety, security, and peace. Summary Provided By: http://tagg.colorado.edu/geophysics/html/ccita.html
type: Concept

ACADEMIC
type: Concept