SPECIES/POPULATION INTERACTIONS
type: Concept

GRAZING DYNAMICS/PLANT HERBIVORY
in scheme: sciencekeywords
definition: Herbivory is an ecological interaction between two species where one species eats part or all of a plant species.
type: Concept